# Problem deploying to Intel Galileo board

**URL:** <https://forum.xod.io/t/problem-deploying-to-intel-galileo-board/2134>\
**Category:** Uncategorized\
**Created:** [April 15, 2019, 5:35pm UTC](https://forum.xod.io/t/problem-deploying-to-intel-galileo-board/2134 "2019-04-15T17:35:50Z")\
**Posts on this page:** 16\
**Page:** 1

<div class="post-metadata">

**Author:** ![omran](https://yyz1.discourse-cdn.com/flex027/user_avatar/forum.xod.io/omran/32/1112_2.png) [@omran](https://forum.xod.io/u/omran)\
**Post date:** [April 15, 2019, 5:35pm UTC](https://forum.xod.io/t/problem-deploying-to-intel-galileo-board/2134/1 "2019-04-15T17:35:50Z")

</div>

From XOD IDE I selected Galileo Gen 2 board, identified the correct port and tried to deploy the “hello” example the process stopped at the compilation step giving the following error

“Compilation failed  
Command `C:\Program Files\XOD IDE\resources\arduino-cli.exe --config-file=C:\Users\Omran\AppData\Local\Temp\arduino-cligf7qA4\.cli-config.yml compile --fqbn Intel:i586:izmir_fg --verbose C:\Users\Omran\AppData\Local\Temp\xod_temp_sketchbook8Q7Bt9\xod_1555349544839_sketch` failed with code 1  
The generated C++ code contains errors. It can be due to a bad node implementation or if your board is not compatible with XOD runtime code. The original compiler error message is above. Fix C++ errors to continue. If you believe it is a bug, report the problem to XOD developers.”

Does any of you faced a same issue? How I can overcome this problem?

---

<div class="post-metadata">

**Author:** ![cesars](https://avatars.discourse-cdn.com/v4/letter/c/f05b48/32.png) [@cesars](https://forum.xod.io/u/cesars)\
**Post date:** [April 15, 2019, 7:09pm UTC](https://forum.xod.io/t/problem-deploying-to-intel-galileo-board/2134/2 "2019-04-15T19:09:48Z")

</div>

The error is up, you must scroll to see the whole message, but I think it is not compatible with XOD currently.

---

<div class="post-metadata">

**Author:** ![vitaliysh](https://yyz1.discourse-cdn.com/flex027/user_avatar/forum.xod.io/vitaliysh/32/1428_2.png) [@vitaliysh](https://forum.xod.io/u/vitaliysh)\
**Post date:** [April 15, 2019, 7:23pm UTC](https://forum.xod.io/t/problem-deploying-to-intel-galileo-board/2134/3 "2019-04-15T19:23:51Z")

</div>

Iskra Nano also not supported. (

---

<div class="post-metadata">

**Author:** ![brusher\_ru](https://yyz1.discourse-cdn.com/flex027/user_avatar/forum.xod.io/brusher_ru/32/12_2.png) [@brusher\_ru](https://forum.xod.io/u/brusher_ru)\
**Post date:** [April 16, 2019, 2:28pm UTC](https://forum.xod.io/t/problem-deploying-to-intel-galileo-board/2134/4 "2019-04-16T14:28:18Z")

</div>

@omran please, provide the full output of `Deployment` pane. Probably, some function that used in the XOD runtime is not supported by this board. 🤔

---

<div class="post-metadata">

**Author:** ![brusher\_ru](https://yyz1.discourse-cdn.com/flex027/user_avatar/forum.xod.io/brusher_ru/32/12_2.png) [@brusher\_ru](https://forum.xod.io/u/brusher_ru)\
**Post date:** [April 16, 2019, 2:30pm UTC](https://forum.xod.io/t/problem-deploying-to-intel-galileo-board/2134/5 "2019-04-16T14:30:31Z")

</div>

@vitaliysh there was a bug in the package index developed by Amperka developers. We’ve reported the bug and now it’s fixed. Just upgrade the package and tools via main menu: `Deploy -> Upgrade Arduino Packages & Toolchains...`

---

<div class="post-metadata">

**Author:** ![omran](https://yyz1.discourse-cdn.com/flex027/user_avatar/forum.xod.io/omran/32/1112_2.png) [@omran](https://forum.xod.io/u/omran)\
**Post date:** [April 16, 2019, 3:26pm UTC](https://forum.xod.io/t/problem-deploying-to-intel-galileo-board/2134/6 "2019-04-16T15:26:51Z")

</div>

I already did and the problem persists.

---

<div class="post-metadata">

**Author:** ![cesars](https://avatars.discourse-cdn.com/v4/letter/c/f05b48/32.png) [@cesars](https://forum.xod.io/u/cesars)\
**Post date:** [April 16, 2019, 3:39pm UTC](https://forum.xod.io/t/problem-deploying-to-intel-galileo-board/2134/7 "2019-04-16T15:39:39Z")

</div>

> [@omran](#):
>
> “Compilation failed  
> Command `C:\Program Files\XOD IDE\resources\arduino-cli.exe --config-`

☝ Above these lines is the complete log, scroll and copy the complete log

It’s what he has asked **brusher\_ru** here. 👇

> [@brusher\_ru](#):
>
> please, provide the full output of `Deployment` pane

---

<div class="post-metadata">

**Author:** ![vitaliysh](https://yyz1.discourse-cdn.com/flex027/user_avatar/forum.xod.io/vitaliysh/32/1428_2.png) [@vitaliysh](https://forum.xod.io/u/vitaliysh)\
**Post date:** [April 16, 2019, 4:27pm UTC](https://forum.xod.io/t/problem-deploying-to-intel-galileo-board/2134/8 "2019-04-16T16:27:00Z")

</div>

Sorry to get in. I do not understand what to choose a board model in XOD for Iskra Nano Pro [http://amperka.ru/product/iskra-nano-pro](http://amperka.ru/product/iskra-nano-pro) ?

---

<div class="post-metadata">

**Author:** ![omran](https://yyz1.discourse-cdn.com/flex027/user_avatar/forum.xod.io/omran/32/1112_2.png) [@omran](https://forum.xod.io/u/omran)\
**Post date:** [April 16, 2019, 5:02pm UTC](https://forum.xod.io/t/problem-deploying-to-intel-galileo-board/2134/9 "2019-04-16T17:02:57Z")

</div>

Here is below the full log. I hope it contains what may solve the problem.

“

Begin compiling code for the board Intel® Galileo Gen2 📦 Using board ‘izmir\_fg’ from platform in folder: C:\Users\Omran\xod\ __packages_\_\packages\Intel\hardware\i586\1.6.7+1.0 Using core ‘arduino’ from platform in folder: C:\Users\Omran\xod\__ packages_\_\packages\Intel\hardware\i586\1.6.7+1.0 Detecting libraries used… “C:\Users\Omran\xod\ **packages** \packages\Intel\tools\i586-poky-linux-uclibc\1.6.2+1.0/pokysdk/usr/bin/i586-poky-linux-uclibc/i586-poky-linux-uclibc-g++” -m32 -march=i586 “–sysroot=C:\Users\Omran\xod\ **packages** \packages\Intel\tools\i586-poky-linux-uclibc\1.6.2+1.0/i586-poky-linux-uclibc” -c -g -Os -w -fno-exceptions -ffunction-sections -fdata-sections -D\_\_ARDUINO\_X86\_\_ -Xassembler -mquark-strip-lock=yes -w -x c++ -E -CC -march=i586 -m32 -DARDUINO=10607 “-IC:\Users\Omran\xod\ **packages** \packages\Intel\hardware\i586\1.6.7+1.0\cores\arduino” “-IC:\Users\Omran\xod\ **packages** \packages\Intel\hardware\i586\1.6.7+1.0\variants\galileo\_fab\_g” “C:\Users\Omran\AppData\Local\Temp\arduino-sketch-1E5F7798D6D44FDC54F3523E784396EB\sketch\xod\_1555433968203\_sketch.ino.cpp” -o nul Generating function prototypes… “C:\Users\Omran\xod\ **packages** \packages\Intel\tools\i586-poky-linux-uclibc\1.6.2+1.0/pokysdk/usr/bin/i586-poky-linux-uclibc/i586-poky-linux-uclibc-g++” -m32 -march=i586 “–sysroot=C:\Users\Omran\xod\ **packages** \packages\Intel\tools\i586-poky-linux-uclibc\1.6.2+1.0/i586-poky-linux-uclibc” -c -g -Os -w -fno-exceptions -ffunction-sections -fdata-sections -D\_\_ARDUINO\_X86\_\_ -Xassembler -mquark-strip-lock=yes -w -x c++ -E -CC -march=i586 -m32 -DARDUINO=10607 “-IC:\Users\Omran\xod\ **packages** \packages\Intel\hardware\i586\1.6.7+1.0\cores\arduino” “-IC:\Users\Omran\xod\ **packages** \packages\Intel\hardware\i586\1.6.7+1.0\variants\galileo\_fab\_g” “C:\Users\Omran\AppData\Local\Temp\arduino-sketch-1E5F7798D6D44FDC54F3523E784396EB\sketch\xod\_1555433968203\_sketch.ino.cpp” -o “C:\Users\Omran\AppData\Local\Temp\arduino-sketch-1E5F7798D6D44FDC54F3523E784396EB\preproc\ctags\_target\_for\_gcc\_minus\_e.cpp” “C:\Users\Omran\xod\ **packages** \packages\builtin\tools\ctags\5.8-arduino11/ctags” -u --language-force=c++ -f - --c+±kinds=svpf --fields=KSTtzns --line-directives “C:\Users\Omran\AppData\Local\Temp\arduino-sketch-1E5F7798D6D44FDC54F3523E784396EB\preproc\ctags\_target\_for\_gcc\_minus\_e.cpp” Compiling sketch… “C:\Users\Omran\xod\ **packages** \packages\Intel\tools\i586-poky-linux-uclibc\1.6.2+1.0/pokysdk/usr/bin/i586-poky-linux-uclibc/i586-poky-linux-uclibc-g++” -m32 -march=i586 “–sysroot=C:\Users\Omran\xod\ **packages** \packages\Intel\tools\i586-poky-linux-uclibc\1.6.2+1.0/i586-poky-linux-uclibc” -c -g -Os -w -fno-exceptions -ffunction-sections -fdata-sections -MMD -D\_\_ARDUINO\_X86\_\_ -Xassembler -mquark-strip-lock=yes -march=i586 -m32 -DARDUINO=10607 “-IC:\Users\Omran\xod\ **packages** \packages\Intel\hardware\i586\1.6.7+1.0\cores\arduino” “-IC:\Users\Omran\xod\ **packages** \packages\Intel\hardware\i586\1.6.7+1.0\variants\galileo\_fab\_g” “C:\Users\Omran\AppData\Local\Temp\arduino-sketch-1E5F7798D6D44FDC54F3523E784396EB\sketch\xod\_1555433968203\_sketch.ino.cpp” -o “C:\Users\Omran\AppData\Local\Temp\arduino-sketch-1E5F7798D6D44FDC54F3523E784396EB\sketch\xod\_1555433968203\_sketch.ino.cpp.o” C:\Users\Omran\AppData\Local\Temp\xod\_temp\_sketchbookRpDenr\xod\_1555433968203\_sketch\xod\_1555433968203\_sketch.ino:60:48: error: template argument 1 is invalid C:\Users\Omran\AppData\Local\Temp\xod\_temp\_sketchbookRpDenr\xod\_1555433968203\_sketch\xod\_1555433968203\_sketch.ino:63:35: error: expected unqualified-id before ‘&&’ token C:\Users\Omran\AppData\Local\Temp\xod\_temp\_sketchbookRpDenr\xod\_1555433968203\_sketch\xod\_1555433968203\_sketch.ino:157:22: error: expected ‘,’ or ‘…’ before ‘&&’ token C:\Users\Omran\AppData\Local\Temp\xod\_temp\_sketchbookRpDenr\xod\_1555433968203\_sketch\xod\_1555433968203\_sketch.ino:157:27: error: invalid constructor; you probably meant ‘xod::Iterator (const xod::Iterator&)’ C:\Users\Omran\AppData\Local\Temp\xod\_temp\_sketchbookRpDenr\xod\_1555433968203\_sketch\xod\_1555433968203\_sketch.ino:163:33: error: expected ‘,’ or ‘…’ before ‘&&’ token C:\Users\Omran\AppData\Local\Temp\xod\_temp\_sketchbookRpDenr\xod\_1555433968203\_sketch\xod\_1555433968203\_sketch.ino: In member function ‘xod::Iterator& xod::Iterator::operator=(xod::Iterator)’: C:\Users\Omran\AppData\Local\Temp\xod\_temp\_sketchbookRpDenr\xod\_1555433968203\_sketch\xod\_1555433968203\_sketch.ino:164:14: error: ‘tmp’ does not name a type C:\Users\Omran\AppData\Local\Temp\xod\_temp\_sketchbookRpDenr\xod\_1555433968203\_sketch\xod\_1555433968203\_sketch.ino:165:9: error: ‘it’ was not declared in this scope C:\Users\Omran\AppData\Local\Temp\xod\_temp\_sketchbookRpDenr\xod\_1555433968203\_sketch\xod\_1555433968203\_sketch.ino:166:19: error: ‘tmp’ was not declared in this scope C:\Users\Omran\AppData\Local\Temp\xod\_temp\_sketchbookRpDenr\xod\_1555433968203\_sketch\xod\_1555433968203\_sketch.ino: At global scope: C:\Users\Omran\AppData\Local\Temp\xod\_temp\_sketchbookRpDenr\xod\_1555433968203\_sketch\xod\_1555433968203\_sketch.ino:216:5: error: ‘constexpr’ does not name a type C:\Users\Omran\AppData\Local\Temp\xod\_temp\_sketchbookRpDenr\xod\_1555433968203\_sketch\xod\_1555433968203\_sketch.ino:216:5: note: C++11 ‘constexpr’ only available with -std=c++11 or -std=gnu++11 C:\Users\Omran\AppData\Local\Temp\xod\_temp\_sketchbookRpDenr\xod\_1555433968203\_sketch\xod\_1555433968203\_sketch.ino:316:35: error: ‘nullptr’ was not declared in this scope C:\Users\Omran\AppData\Local\Temp\xod\_temp\_sketchbookRpDenr\xod\_1555433968203\_sketch\xod\_1555433968203\_sketch.ino: In member function ‘virtual xod::Iterator xod::CStringView::iterate() const’: C:\Users\Omran\AppData\Local\Temp\xod\_temp\_sketchbookRpDenr\xod\_1555433968203\_sketch\xod\_1555433968203\_sketch.ino:326:78: error: use of deleted function ‘xod::Iterator::Iterator(const xod::Iterator&) [with T = char; xod::Iterator = xod::Iterator]’ C:\Users\Omran\AppData\Local\Temp\xod\_temp\_sketchbookRpDenr\xod\_1555433968203\_sketch\xod\_1555433968203\_sketch.ino:154:5: error: declared here C:\Users\Omran\AppData\Local\Temp\xod\_temp\_sketchbookRpDenr\xod\_1555433968203\_sketch\xod\_1555433968203\_sketch.ino: At global scope: C:\Users\Omran\AppData\Local\Temp\xod\_temp\_sketchbookRpDenr\xod\_1555433968203\_sketch\xod\_1555433968203\_sketch.ino:344:27: error: expected ‘,’ or ‘…’ before ‘&&’ token C:\Users\Omran\AppData\Local\Temp\xod\_temp\_sketchbookRpDenr\xod\_1555433968203\_sketch\xod\_1555433968203\_sketch.ino: In constructor ‘xod::ConcatListView::Cursor::Cursor(xod::Iterator)’: C:\Users\Omran\AppData\Local\Temp\xod\_temp\_sketchbookRpDenr\xod\_1555433968203\_sketch\xod\_1555433968203\_sketch.ino:345:21: error: ‘move’ is not a member of ‘xod::std’ C:\Users\Omran\AppData\Local\Temp\xod\_temp\_sketchbookRpDenr\xod\_1555433968203\_sketch\xod\_1555433968203\_sketch.ino:345:31: error: ‘left’ was not declared in this scope C:\Users\Omran\AppData\Local\Temp\xod\_temp\_sketchbookRpDenr\xod\_1555433968203\_sketch\xod\_1555433968203\_sketch.ino:346:22: error: ‘move’ is not a member of ‘xod::std’ C:\Users\Omran\AppData\Local\Temp\xod\_temp\_sketchbookRpDenr\xod\_1555433968203\_sketch\xod\_1555433968203\_sketch.ino:346:32: error: ‘right’ was not declared in this scope C:\Users\Omran\AppData\Local\Temp\xod\_temp\_sketchbookRpDenr\xod\_1555433968203\_sketch\xod\_1555433968203\_sketch.ino: At global scope: C:\Users\Omran\AppData\Local\Temp\xod\_temp\_sketchbookRpDenr\xod\_1555433968203\_sketch\xod\_1555433968203\_sketch.ino:394:7: error: expected nested-name-specifier before ‘XString’ C:\Users\Omran\AppData\Local\Temp\xod\_temp\_sketchbookRpDenr\xod\_1555433968203\_sketch\xod\_1555433968203\_sketch.ino:394:7: error: ‘XString’ has not been declared C:\Users\Omran\AppData\Local\Temp\xod\_temp\_sketchbookRpDenr\xod\_1555433968203\_sketch\xod\_1555433968203\_sketch.ino:394:15: error: expected ‘;’ before ‘=’ token C:\Users\Omran\AppData\Local\Temp\xod\_temp\_sketchbookRpDenr\xod\_1555433968203\_sketch\xod\_1555433968203\_sketch.ino:394:15: error: expected unqualified-id before ‘=’ token C:\Users\Omran\AppData\Local\Temp\xod\_temp\_sketchbookRpDenr\xod\_1555433968203\_sketch\xod\_1555433968203\_sketch.ino:400:39: error: expected class-name before ‘{’ token C:\Users\Omran\AppData\Local\Temp\xod\_temp\_sketchbookRpDenr\xod\_1555433968203\_sketch\xod\_1555433968203\_sketch.ino: In constructor ‘xod::XStringCString::XStringCString(const char\*)’: C:\Users\Omran\AppData\Local\Temp\xod\_temp\_sketchbookRpDenr\xod\_1555433968203\_sketch\xod\_1555433968203\_sketch.ino:403:11: error: class ‘xod::XStringCString’ does not have any field named ‘XString’ C:\Users\Omran\AppData\Local\Temp\xod\_temp\_sketchbookRpDenr\xod\_1555433968203\_sketch\xod\_1555433968203\_sketch.ino: In member function ‘virtual SoftwareSerial\* xod::Uart::toSoftwareSerial()’: C:\Users\Omran\AppData\Local\Temp\xod\_temp\_sketchbookRpDenr\xod\_1555433968203\_sketch\xod\_1555433968203\_sketch.ino:467:14: error: ‘nullptr’ was not declared in this scope C:\Users\Omran\AppData\Local\Temp\xod\_temp\_sketchbookRpDenr\xod\_1555433968203\_sketch\xod\_1555433968203\_sketch.ino: In member function ‘virtual HardwareSerial\* xod::Uart::toHardwareSerial()’: C:\Users\Omran\AppData\Local\Temp\xod\_temp\_sketchbookRpDenr\xod\_1555433968203\_sketch\xod\_1555433968203\_sketch.ino:471:14: error: ‘nullptr’ was not declared in this scope C:\Users\Omran\AppData\Local\Temp\xod\_temp\_sketchbookRpDenr\xod\_1555433968203\_sketch\xod\_1555433968203\_sketch.ino: In function ‘TR xod::foldl(xod::List, TR (\*)(TR, T), TR)’: C:\Users\Omran\AppData\Local\Temp\xod\_temp\_sketchbookRpDenr\xod\_1555433968203\_sketch\xod\_1555433968203\_sketch.ino:560:15: error: ‘it’ does not name a type C:\Users\Omran\AppData\Local\Temp\xod\_temp\_sketchbookRpDenr\xod\_1555433968203\_sketch\xod\_1555433968203\_sketch.ino:560:34: error: expected ‘;’ before ‘it’ C:\Users\Omran\AppData\Local\Temp\xod\_temp\_sketchbookRpDenr\xod\_1555433968203\_sketch\xod\_1555433968203\_sketch.ino:560:34: error: ‘it’ was not declared in this scope C:\Users\Omran\AppData\Local\Temp\xod\_temp\_sketchbookRpDenr\xod\_1555433968203\_sketch\xod\_1555433968203\_sketch.ino: In function ‘bool xod::equal(xod::List, xod::List)’: C:\Users\Omran\AppData\Local\Temp\xod\_temp\_sketchbookRpDenr\xod\_1555433968203\_sketch\xod\_1555433968203\_sketch.ino:595:10: error: ‘lhsIt’ does not name a type C:\Users\Omran\AppData\Local\Temp\xod\_temp\_sketchbookRpDenr\xod\_1555433968203\_sketch\xod\_1555433968203\_sketch.ino:596:10: error: ‘rhsIt’ does not name a type C:\Users\Omran\AppData\Local\Temp\xod\_temp\_sketchbookRpDenr\xod\_1555433968203\_sketch\xod\_1555433968203\_sketch.ino:598:12: error: ‘lhsIt’ was not declared in this scope C:\Users\Omran\AppData\Local\Temp\xod\_temp\_sketchbookRpDenr\xod\_1555433968203\_sketch\xod\_1555433968203\_sketch.ino:598:21: error: ‘rhsIt’ was not declared in this scope C:\Users\Omran\AppData\Local\Temp\xod\_temp\_sketchbookRpDenr\xod\_1555433968203\_sketch\xod\_1555433968203\_sketch.ino:602:13: error: ‘lhsIt’ was not declared in this scope C:\Users\Omran\AppData\Local\Temp\xod\_temp\_sketchbookRpDenr\xod\_1555433968203\_sketch\xod\_1555433968203\_sketch.ino:602:23: error: ‘rhsIt’ was not declared in this scope C:\Users\Omran\AppData\Local\Temp\xod\_temp\_sketchbookRpDenr\xod\_1555433968203\_sketch\xod\_1555433968203\_sketch.ino: At global scope: C:\Users\Omran\AppData\Local\Temp\xod\_temp\_sketchbookRpDenr\xod\_1555433968203\_sketch\xod\_1555433968203\_sketch.ino:971:50: error: expected nested-name-specifier before ‘T’ C:\Users\Omran\AppData\Local\Temp\xod\_temp\_sketchbookRpDenr\xod\_1555433968203\_sketch\xod\_1555433968203\_sketch.ino:971:50: error: using-declaration for non-member at class scope C:\Users\Omran\AppData\Local\Temp\xod\_temp\_sketchbookRpDenr\xod\_1555433968203\_sketch\xod\_1555433968203\_sketch.ino:971:52: error: expected ‘;’ before ‘=’ token C:\Users\Omran\AppData\Local\Temp\xod\_temp\_sketchbookRpDenr\xod\_1555433968203\_sketch\xod\_1555433968203\_sketch.ino:971:52: error: expected unqualified-id before ‘=’ token C:\Users\Omran\AppData\Local\Temp\xod\_temp\_sketchbookRpDenr\xod\_1555433968203\_sketch\xod\_1555433968203\_sketch.ino:972:50: error: expected nested-name-specifier before ‘T’ C:\Users\Omran\AppData\Local\Temp\xod\_temp\_sketchbookRpDenr\xod\_1555433968203\_sketch\xod\_1555433968203\_sketch.ino:972:50: error: using-declaration for non-member at class scope C:\Users\Omran\AppData\Local\Temp\xod\_temp\_sketchbookRpDenr\xod\_1555433968203\_sketch\xod\_1555433968203\_sketch.ino:972:52: error: expected ‘;’ before ‘=’ token C:\Users\Omran\AppData\Local\Temp\xod\_temp\_sketchbookRpDenr\xod\_1555433968203\_sketch\xod\_1555433968203\_sketch.ino:972:52: error: expected unqualified-id before ‘=’ token C:\Users\Omran\AppData\Local\Temp\xod\_temp\_sketchbookRpDenr\xod\_1555433968203\_sketch\xod\_1555433968203\_sketch.ino:979:7: error: expected nested-name-specifier before ‘Context’ C:\Users\Omran\AppData\Local\Temp\xod\_temp\_sketchbookRpDenr\xod\_1555433968203\_sketch\xod\_1555433968203\_sketch.ino:979:7: error: ‘Context’ has not been declared C:\Users\Omran\AppData\Local\Temp\xod\_temp\_sketchbookRpDenr\xod\_1555433968203\_sketch\xod\_1555433968203\_sketch.ino:979:15: error: expected ‘;’ before ‘=’ token C:\Users\Omran\AppData\Local\Temp\xod\_temp\_sketchbookRpDenr\xod\_1555433968203\_sketch\xod\_1555433968203\_sketch.ino:979:15: error: expected unqualified-id before ‘=’ token C:\Users\Omran\AppData\Local\Temp\xod\_temp\_sketchbookRpDenr\xod\_1555433968203\_sketch\xod\_1555433968203\_sketch.ino:981:62: error: template declaration of ‘typename xod::xod\_\_core\_\_continuously::ValueType::T xod::xod\_\_core\_\_continuously::getValue’ C:\Users\Omran\AppData\Local\Temp\xod\_temp\_sketchbookRpDenr\xod\_1555433968203\_sketch\xod\_1555433968203\_sketch.ino:981:62: error: ‘Context’ was not declared in this scope C:\Users\Omran\AppData\Local\Temp\xod\_temp\_sketchbookRpDenr\xod\_1555433968203\_sketch\xod\_1555433968203\_sketch.ino:988:26: error: expected initializer before ‘\<’ token C:\Users\Omran\AppData\Local\Temp\xod\_temp\_sketchbookRpDenr\xod\_1555433968203\_sketch\xod\_1555433968203\_sketch.ino:992:45: error: template declaration of ‘bool xod::xod\_\_core\_\_continuously::isInputDirty’ C:\Users\Omran\AppData\Local\Temp\xod\_temp\_sketchbookRpDenr\xod\_1555433968203\_sketch\xod\_1555433968203\_sketch.ino:992:45: error: ‘Context’ was not declared in this scope C:\Users\Omran\AppData\Local\Temp\xod\_temp\_sketchbookRpDenr\xod\_1555433968203\_sketch\xod\_1555433968203\_sketch.ino:999:43: error: variable or field ‘emitValue’ declared void C:\Users\Omran\AppData\Local\Temp\xod\_temp\_sketchbookRpDenr\xod\_1555433968203\_sketch\xod\_1555433968203\_sketch.ino:999:43: error: ‘Context’ was not declared in this scope C:\Users\Omran\AppData\Local\Temp\xod\_temp\_sketchbookRpDenr\xod\_1555433968203\_sketch\xod\_1555433968203\_sketch.ino:999:87: error: expected ‘(’ before ‘val’ C:\Users\Omran\AppData\Local\Temp\xod\_temp\_sketchbookRpDenr\xod\_1555433968203\_sketch\xod\_1555433968203\_sketch.ino:1005:26: error: expected initializer before ‘\<’ token C:\Users\Omran\AppData\Local\Temp\xod\_temp\_sketchbookRpDenr\xod\_1555433968203\_sketch\xod\_1555433968203\_sketch.ino:1010:17: error: ‘Context’ was not declared in this scope C:\Users\Omran\AppData\Local\Temp\xod\_temp\_sketchbookRpDenr\xod\_1555433968203\_sketch\xod\_1555433968203\_sketch.ino:1010:30: error: expected ‘,’ or ‘;’ before ‘{’ token C:\Users\Omran\AppData\Local\Temp\xod\_temp\_sketchbookRpDenr\xod\_1555433968203\_sketch\xod\_1555433968203\_sketch.ino:1014:15: error: variable or field ‘evaluate’ declared void C:\Users\Omran\AppData\Local\Temp\xod\_temp\_sketchbookRpDenr\xod\_1555433968203\_sketch\xod\_1555433968203\_sketch.ino:1014:15: error: ‘Context’ was not declared in this scope C:\Users\Omran\AppData\Local\Temp\xod\_temp\_sketchbookRpDenr\xod\_1555433968203\_sketch\xod\_1555433968203\_sketch.ino:1056:50: error: expected nested-name-specifier before ‘T’ C:\Users\Omran\AppData\Local\Temp\xod\_temp\_sketchbookRpDenr\xod\_1555433968203\_sketch\xod\_1555433968203\_sketch.ino:1056:50: error: using-declaration for non-member at class scope C:\Users\Omran\AppData\Local\Temp\xod\_temp\_sketchbookRpDenr\xod\_1555433968203\_sketch\xod\_1555433968203\_sketch.ino:1056:52: error: expected ‘;’ before ‘=’ token C:\Users\Omran\AppData\Local\Temp\xod\_temp\_sketchbookRpDenr\xod\_1555433968203\_sketch\xod\_1555433968203\_sketch.ino:1056:52: error: expected unqualified-id before ‘=’ token C:\Users\Omran\AppData\Local\Temp\xod\_temp\_sketchbookRpDenr\xod\_1555433968203\_sketch\xod\_1555433968203\_sketch.ino:1057:46: error: expected nested-name-specifier before ‘T’ C:\Users\Omran\AppData\Local\Temp\xod\_temp\_sketchbookRpDenr\xod\_1555433968203\_sketch\xod\_1555433968203\_sketch.ino:1057:46: error: using-declaration for non-member at class scope C:\Users\Omran\AppData\Local\Temp\xod\_temp\_sketchbookRpDenr\xod\_1555433968203\_sketch\xod\_1555433968203\_sketch.ino:1057:48: error: expected ‘;’ before ‘=’ token C:\Users\Omran\AppData\Local\Temp\xod\_temp\_sketchbookRpDenr\xod\_1555433968203\_sketch\xod\_1555433968203\_sketch.ino:1057:48: error: expected unqualified-id before ‘=’ token C:\Users\Omran\AppData\Local\Temp\xod\_temp\_sketchbookRpDenr\xod\_1555433968203\_sketch\xod\_1555433968203\_sketch.ino:1058:49: error: expected nested-name-specifier before ‘T’ C:\Users\Omran\AppData\Local\Temp\xod\_temp\_sketchbookRpDenr\xod\_1555433968203\_sketch\xod\_1555433968203\_sketch.ino:1058:49: error: using-declaration for non-member at class scope C:\Users\Omran\AppData\Local\Temp\xod\_temp\_sketchbookRpDenr\xod\_1555433968203\_sketch\xod\_1555433968203\_sketch.ino:1058:51: error: expected ‘;’ before ‘=’ token C:\Users\Omran\AppData\Local\Temp\xod\_temp\_sketchbookRpDenr\xod\_1555433968203\_sketch\xod\_1555433968203\_sketch.ino:1058:51: error: expected unqualified-id before ‘=’ token C:\Users\Omran\AppData\Local\Temp\xod\_temp\_sketchbookRpDenr\xod\_1555433968203\_sketch\xod\_1555433968203\_sketch.ino:1059:47: error: expected nested-name-specifier before ‘T’ C:\Users\Omran\AppData\Local\Temp\xod\_temp\_sketchbookRpDenr\xod\_1555433968203\_sketch\xod\_1555433968203\_sketch.ino:1059:47: error: using-declaration for non-member at class scope C:\Users\Omran\AppData\Local\Temp\xod\_temp\_sketchbookRpDenr\xod\_1555433968203\_sketch\xod\_1555433968203\_sketch.ino:1059:49: error: expected ‘;’ before ‘=’ token C:\Users\Omran\AppData\Local\Temp\xod\_temp\_sketchbookRpDenr\xod\_1555433968203\_sketch\xod\_1555433968203\_sketch.ino:1059:49: error: expected unqualified-id before ‘=’ token C:\Users\Omran\AppData\Local\Temp\xod\_temp\_sketchbookRpDenr\xod\_1555433968203\_sketch\xod\_1555433968203\_sketch.ino:1060:48: error: expected nested-name-specifier before ‘T’ C:\Users\Omran\AppData\Local\Temp\xod\_temp\_sketchbookRpDenr\xod\_1555433968203\_sketch\xod\_1555433968203\_sketch.ino:1060:48: error: using-declaration for non-member at class scope C:\Users\Omran\AppData\Local\Temp\xod\_temp\_sketchbookRpDenr\xod\_1555433968203\_sketch\xod\_1555433968203\_sketch.ino:1060:50: error: expected ‘;’ before ‘=’ token C:\Users\Omran\AppData\Local\Temp\xod\_temp\_sketchbookRpDenr\xod\_1555433968203\_sketch\xod\_1555433968203\_sketch.ino:1060:50: error: expected unqualified-id before ‘=’ token C:\Users\Omran\AppData\Local\Temp\xod\_temp\_sketchbookRpDenr\xod\_1555433968203\_sketch\xod\_1555433968203\_sketch.ino:1061:49: error: expected nested-name-specifier before ‘T’ C:\Users\Omran\AppData\Local\Temp\xod\_temp\_sketchbookRpDenr\xod\_1555433968203\_sketch\xod\_1555433968203\_sketch.ino:1061:49: error: using-declaration for non-member at class scope C:\Users\Omran\AppData\Local\Temp\xod\_temp\_sketchbookRpDenr\xod\_1555433968203\_sketch\xod\_1555433968203\_sketch.ino:1061:51: error: expected ‘;’ before ‘=’ token C:\Users\Omran\AppData\Local\Temp\xod\_temp\_sketchbookRpDenr\xod\_1555433968203\_sketch\xod\_1555433968203\_sketch.ino:1061:51: error: expected unqualified-id before ‘=’ token C:\Users\Omran\AppData\Local\Temp\xod\_temp\_sketchbookRpDenr\xod\_1555433968203\_sketch\xod\_1555433968203\_sketch.ino:1062:47: error: expected nested-name-specifier before ‘T’ C:\Users\Omran\AppData\Local\Temp\xod\_temp\_sketchbookRpDenr\xod\_1555433968203\_sketch\xod\_1555433968203\_sketch.ino:1062:47: error: using-declaration for non-member at class scope C:\Users\Omran\AppData\Local\Temp\xod\_temp\_sketchbookRpDenr\xod\_1555433968203\_sketch\xod\_1555433968203\_sketch.ino:1062:49: error: expected ‘;’ before ‘=’ token C:\Users\Omran\AppData\Local\Temp\xod\_temp\_sketchbookRpDenr\xod\_1555433968203\_sketch\xod\_1555433968203\_sketch.ino:1062:49: error: expected unqualified-id before ‘=’ token C:\Users\Omran\AppData\Local\Temp\xod\_temp\_sketchbookRpDenr\xod\_1555433968203\_sketch\xod\_1555433968203\_sketch.ino:1075:7: error: expected nested-name-specifier before ‘Context’ C:\Users\Omran\AppData\Local\Temp\xod\_temp\_sketchbookRpDenr\xod\_1555433968203\_sketch\xod\_1555433968203\_sketch.ino:1075:7: error: ‘Context’ has not been declared C:\Users\Omran\AppData\Local\Temp\xod\_temp\_sketchbookRpDenr\xod\_1555433968203\_sketch\xod\_1555433968203\_sketch.ino:1075:15: error: expected ‘;’ before ‘=’ token C:\Users\Omran\AppData\Local\Temp\xod\_temp\_sketchbookRpDenr\xod\_1555433968203\_sketch\xod\_1555433968203\_sketch.ino:1075:15: error: expected unqualified-id before ‘=’ token C:\Users\Omran\AppData\Local\Temp\xod\_temp\_sketchbookRpDenr\xod\_1555433968203\_sketch\xod\_1555433968203\_sketch.ino:1077:62: error: template declaration of ‘typename xod::xod\_\_core\_\_square\_wave::ValueType::T xod::xod\_\_core\_\_square\_wave::getValue’ C:\Users\Omran\AppData\Local\Temp\xod\_temp\_sketchbookRpDenr\xod\_1555433968203\_sketch\xod\_1555433968203\_sketch.ino:1077:62: error: ‘Context’ was not declared in this scope C:\Users\Omran\AppData\Local\Temp\xod\_temp\_sketchbookRpDenr\xod\_1555433968203\_sketch\xod\_1555433968203\_sketch.ino:1084:27: error: expected initializer before ‘\<’ token C:\Users\Omran\AppData\Local\Temp\xod\_temp\_sketchbookRpDenr\xod\_1555433968203\_sketch\xod\_1555433968203\_sketch.ino:1087:27: error: expected initializer before ‘\<’ token C:\Users\Omran\AppData\Local\Temp\xod\_temp\_sketchbookRpDenr\xod\_1555433968203\_sketch\xod\_1555433968203\_sketch.ino:1090:26: error: expected initializer before ‘\<’ token C:\Users\Omran\AppData\Local\Temp\xod\_temp\_sketchbookRpDenr\xod\_1555433968203\_sketch\xod\_1555433968203\_sketch.ino:1093:26: error: expected initializer before ‘\<’ token C:\Users\Omran\AppData\Local\Temp\xod\_temp\_sketchbookRpDenr\xod\_1555433968203\_sketch\xod\_1555433968203\_sketch.ino:1096:26: error: expected initializer before ‘\<’ token C:\Users\Omran\AppData\Local\Temp\xod\_temp\_sketchbookRpDenr\xod\_1555433968203\_sketch\xod\_1555433968203\_sketch.ino:1099:27: error: expected initializer before ‘\<’ token C:\Users\Omran\AppData\Local\Temp\xod\_temp\_sketchbookRpDenr\xod\_1555433968203\_sketch\xod\_1555433968203\_sketch.ino:1103:45: error: template declaration of ‘bool xod::xod\_\_core\_\_square\_wave::isInputDirty’ C:\Users\Omran\AppData\Local\Temp\xod\_temp\_sketchbookRpDenr\xod\_1555433968203\_sketch\xod\_1555433968203\_sketch.ino:1103:45: error: ‘Context’ was not declared in this scope C:\Users\Omran\AppData\Local\Temp\xod\_temp\_sketchbookRpDenr\xod\_1555433968203\_sketch\xod\_1555433968203\_sketch.ino:1110:29: error: expected initializer before ‘\<’ token C:\Users\Omran\AppData\Local\Temp\xod\_temp\_sketchbookRpDenr\xod\_1555433968203\_sketch\xod\_1555433968203\_sketch.ino:1114:43: error: variable or field ‘emitValue’ declared void C:\Users\Omran\AppData\Local\Temp\xod\_temp\_sketchbookRpDenr\xod\_1555433968203\_sketch\xod\_1555433968203\_sketch.ino:1114:43: error: ‘Context’ was not declared in this scope C:\Users\Omran\AppData\Local\Temp\xod\_temp\_sketchbookRpDenr\xod\_1555433968203\_sketch\xod\_1555433968203\_sketch.ino:1114:87: error: expected ‘(’ before ‘val’ C:\Users\Omran\AppData\Local\Temp\xod\_temp\_sketchbookRpDenr\xod\_1555433968203\_sketch\xod\_1555433968203\_sketch.ino:1120:26: error: expected initializer before ‘\<’ token C:\Users\Omran\AppData\Local\Temp\xod\_temp\_sketchbookRpDenr\xod\_1555433968203\_sketch\xod\_1555433968203\_sketch.ino:1124:26: error: expected initializer before ‘\<’ token C:\Users\Omran\AppData\Local\Temp\xod\_temp\_sketchbookRpDenr\xod\_1555433968203\_sketch\xod\_1555433968203\_sketch.ino:1129:17: error: ‘Context’ was not declared in this scope C:\Users\Omran\AppData\Local\Temp\xod\_temp\_sketchbookRpDenr\xod\_1555433968203\_sketch\xod\_1555433968203\_sketch.ino:1129:30: error: expected ‘,’ or ‘;’ before ‘{’ token C:\Users\Omran\AppData\Local\Temp\xod\_temp\_sketchbookRpDenr\xod\_1555433968203\_sketch\xod\_1555433968203\_sketch.ino:1133:15: error: variable or field ‘evaluate’ declared void C:\Users\Omran\AppData\Local\Temp\xod\_temp\_sketchbookRpDenr\xod\_1555433968203\_sketch\xod\_1555433968203\_sketch.ino:1133:15: error: ‘Context’ was not declared in this scope C:\Users\Omran\AppData\Local\Temp\xod\_temp\_sketchbookRpDenr\xod\_1555433968203\_sketch\xod\_1555433968203\_sketch.ino:1486:28: error: expected ‘}’ before end of line C:\Users\Omran\AppData\Local\Temp\xod\_temp\_sketchbookRpDenr\xod\_1555433968203\_sketch\xod\_1555433968203\_sketch.ino:1486:28: error: expected ‘}’ before end of line C:\Users\Omran\AppData\Local\Temp\xod\_temp\_sketchbookRpDenr\xod\_1555433968203\_sketch\xod\_1555433968203\_sketch.ino:1486:28: error: expected declaration before end of line C:\Users\Omran\AppData\Local\Temp\xod\_temp\_sketchbookRpDenr\xod\_1555433968203\_sketch\xod\_1555433968203\_sketch.ino: In instantiation of ‘static xod::Iterator xod::Iterator::nil() [with T = char]’: C:\Users\Omran\AppData\Local\Temp\xod\_temp\_sketchbookRpDenr\xod\_1555433968203\_sketch\xod\_1555433968203\_sketch.ino:326:74: required from here C:\Users\Omran\AppData\Local\Temp\xod\_temp\_sketchbookRpDenr\xod\_1555433968203\_sketch\xod\_1555433968203\_sketch.ino:142:54: error: use of deleted function ‘xod::Iterator::Iterator(const xod::Iterator&) [with T = char; xod::Iterator = xod::Iterator]’ C:\Users\Omran\AppData\Local\Temp\xod\_temp\_sketchbookRpDenr\xod\_1555433968203\_sketch\xod\_1555433968203\_sketch.ino:154:5: error: declared here Error: exit status 1 Compilation failed.

Compilation failed Command `C:\Program Files\XOD IDE\resources\arduino-cli.exe --config-file=C:\Users\Omran\AppData\Local\Temp\arduino-clieZBpQw\.cli-config.yml compile --fqbn Intel:i586:izmir_fg --verbose C:\Users\Omran\AppData\Local\Temp\xod_temp_sketchbookRpDenr\xod_1555433968203_sketch` failed with code 1 The generated C++ code contains errors. It can be due to a bad node implementation or if your board is not compatible with XOD runtime code. The original compiler error message is above. Fix C++ errors to continue. If you believe it is a bug, report the problem to XOD developers.

“

---

<div class="post-metadata">

**Author:** ![omran](https://yyz1.discourse-cdn.com/flex027/user_avatar/forum.xod.io/omran/32/1112_2.png) [@omran](https://forum.xod.io/u/omran)\
**Post date:** [April 16, 2019, 5:05pm UTC](https://forum.xod.io/t/problem-deploying-to-intel-galileo-board/2134/10 "2019-04-16T17:05:53Z")

</div>

Here is below the full log. I hope it contains something that may solve the problem.

“

Begin compiling code for the board Intel® Galileo Gen2 📦 Using board ‘izmir\_fg’ from platform in folder: C:\Users\Omran\xod\ __packages_\_\packages\Intel\hardware\i586\1.6.7+1.0 Using core ‘arduino’ from platform in folder: C:\Users\Omran\xod\__ packages_\_\packages\Intel\hardware\i586\1.6.7+1.0 Detecting libraries used… “C:\Users\Omran\xod\ **packages** \packages\Intel\tools\i586-poky-linux-uclibc\1.6.2+1.0/pokysdk/usr/bin/i586-poky-linux-uclibc/i586-poky-linux-uclibc-g++” -m32 -march=i586 “–sysroot=C:\Users\Omran\xod\ **packages** \packages\Intel\tools\i586-poky-linux-uclibc\1.6.2+1.0/i586-poky-linux-uclibc” -c -g -Os -w -fno-exceptions -ffunction-sections -fdata-sections -D\_\_ARDUINO\_X86\_\_ -Xassembler -mquark-strip-lock=yes -w -x c++ -E -CC -march=i586 -m32 -DARDUINO=10607 “-IC:\Users\Omran\xod\ **packages** \packages\Intel\hardware\i586\1.6.7+1.0\cores\arduino” “-IC:\Users\Omran\xod\ **packages** \packages\Intel\hardware\i586\1.6.7+1.0\variants\galileo\_fab\_g” “C:\Users\Omran\AppData\Local\Temp\arduino-sketch-1E5F7798D6D44FDC54F3523E784396EB\sketch\xod\_1555433968203\_sketch.ino.cpp” -o nul Generating function prototypes… “C:\Users\Omran\xod\ **packages** \packages\Intel\tools\i586-poky-linux-uclibc\1.6.2+1.0/pokysdk/usr/bin/i586-poky-linux-uclibc/i586-poky-linux-uclibc-g++” -m32 -march=i586 “–sysroot=C:\Users\Omran\xod\ **packages** \packages\Intel\tools\i586-poky-linux-uclibc\1.6.2+1.0/i586-poky-linux-uclibc” -c -g -Os -w -fno-exceptions -ffunction-sections -fdata-sections -D\_\_ARDUINO\_X86\_\_ -Xassembler -mquark-strip-lock=yes -w -x c++ -E -CC -march=i586 -m32 -DARDUINO=10607 “-IC:\Users\Omran\xod\ **packages** \packages\Intel\hardware\i586\1.6.7+1.0\cores\arduino” “-IC:\Users\Omran\xod\ **packages** \packages\Intel\hardware\i586\1.6.7+1.0\variants\galileo\_fab\_g” “C:\Users\Omran\AppData\Local\Temp\arduino-sketch-1E5F7798D6D44FDC54F3523E784396EB\sketch\xod\_1555433968203\_sketch.ino.cpp” -o “C:\Users\Omran\AppData\Local\Temp\arduino-sketch-1E5F7798D6D44FDC54F3523E784396EB\preproc\ctags\_target\_for\_gcc\_minus\_e.cpp” “C:\Users\Omran\xod\ **packages** \packages\builtin\tools\ctags\5.8-arduino11/ctags” -u --language-force=c++ -f - --c+±kinds=svpf --fields=KSTtzns --line-directives “C:\Users\Omran\AppData\Local\Temp\arduino-sketch-1E5F7798D6D44FDC54F3523E784396EB\preproc\ctags\_target\_for\_gcc\_minus\_e.cpp” Compiling sketch… “C:\Users\Omran\xod\ **packages** \packages\Intel\tools\i586-poky-linux-uclibc\1.6.2+1.0/pokysdk/usr/bin/i586-poky-linux-uclibc/i586-poky-linux-uclibc-g++” -m32 -march=i586 “–sysroot=C:\Users\Omran\xod\ **packages** \packages\Intel\tools\i586-poky-linux-uclibc\1.6.2+1.0/i586-poky-linux-uclibc” -c -g -Os -w -fno-exceptions -ffunction-sections -fdata-sections -MMD -D\_\_ARDUINO\_X86\_\_ -Xassembler -mquark-strip-lock=yes -march=i586 -m32 -DARDUINO=10607 “-IC:\Users\Omran\xod\ **packages** \packages\Intel\hardware\i586\1.6.7+1.0\cores\arduino” “-IC:\Users\Omran\xod\ **packages** \packages\Intel\hardware\i586\1.6.7+1.0\variants\galileo\_fab\_g” “C:\Users\Omran\AppData\Local\Temp\arduino-sketch-1E5F7798D6D44FDC54F3523E784396EB\sketch\xod\_1555433968203\_sketch.ino.cpp” -o “C:\Users\Omran\AppData\Local\Temp\arduino-sketch-1E5F7798D6D44FDC54F3523E784396EB\sketch\xod\_1555433968203\_sketch.ino.cpp.o” C:\Users\Omran\AppData\Local\Temp\xod\_temp\_sketchbookRpDenr\xod\_1555433968203\_sketch\xod\_1555433968203\_sketch.ino:60:48: error: template argument 1 is invalid C:\Users\Omran\AppData\Local\Temp\xod\_temp\_sketchbookRpDenr\xod\_1555433968203\_sketch\xod\_1555433968203\_sketch.ino:63:35: error: expected unqualified-id before ‘&&’ token C:\Users\Omran\AppData\Local\Temp\xod\_temp\_sketchbookRpDenr\xod\_1555433968203\_sketch\xod\_1555433968203\_sketch.ino:157:22: error: expected ‘,’ or ‘…’ before ‘&&’ token C:\Users\Omran\AppData\Local\Temp\xod\_temp\_sketchbookRpDenr\xod\_1555433968203\_sketch\xod\_1555433968203\_sketch.ino:157:27: error: invalid constructor; you probably meant ‘xod::Iterator (const xod::Iterator&)’ C:\Users\Omran\AppData\Local\Temp\xod\_temp\_sketchbookRpDenr\xod\_1555433968203\_sketch\xod\_1555433968203\_sketch.ino:163:33: error: expected ‘,’ or ‘…’ before ‘&&’ token C:\Users\Omran\AppData\Local\Temp\xod\_temp\_sketchbookRpDenr\xod\_1555433968203\_sketch\xod\_1555433968203\_sketch.ino: In member function ‘xod::Iterator& xod::Iterator::operator=(xod::Iterator)’: C:\Users\Omran\AppData\Local\Temp\xod\_temp\_sketchbookRpDenr\xod\_1555433968203\_sketch\xod\_1555433968203\_sketch.ino:164:14: error: ‘tmp’ does not name a type C:\Users\Omran\AppData\Local\Temp\xod\_temp\_sketchbookRpDenr\xod\_1555433968203\_sketch\xod\_1555433968203\_sketch.ino:165:9: error: ‘it’ was not declared in this scope C:\Users\Omran\AppData\Local\Temp\xod\_temp\_sketchbookRpDenr\xod\_1555433968203\_sketch\xod\_1555433968203\_sketch.ino:166:19: error: ‘tmp’ was not declared in this scope C:\Users\Omran\AppData\Local\Temp\xod\_temp\_sketchbookRpDenr\xod\_1555433968203\_sketch\xod\_1555433968203\_sketch.ino: At global scope: C:\Users\Omran\AppData\Local\Temp\xod\_temp\_sketchbookRpDenr\xod\_1555433968203\_sketch\xod\_1555433968203\_sketch.ino:216:5: error: ‘constexpr’ does not name a type C:\Users\Omran\AppData\Local\Temp\xod\_temp\_sketchbookRpDenr\xod\_1555433968203\_sketch\xod\_1555433968203\_sketch.ino:216:5: note: C++11 ‘constexpr’ only available with -std=c++11 or -std=gnu++11 C:\Users\Omran\AppData\Local\Temp\xod\_temp\_sketchbookRpDenr\xod\_1555433968203\_sketch\xod\_1555433968203\_sketch.ino:316:35: error: ‘nullptr’ was not declared in this scope C:\Users\Omran\AppData\Local\Temp\xod\_temp\_sketchbookRpDenr\xod\_1555433968203\_sketch\xod\_1555433968203\_sketch.ino: In member function ‘virtual xod::Iterator xod::CStringView::iterate() const’: C:\Users\Omran\AppData\Local\Temp\xod\_temp\_sketchbookRpDenr\xod\_1555433968203\_sketch\xod\_1555433968203\_sketch.ino:326:78: error: use of deleted function ‘xod::Iterator::Iterator(const xod::Iterator&) [with T = char; xod::Iterator = xod::Iterator]’ C:\Users\Omran\AppData\Local\Temp\xod\_temp\_sketchbookRpDenr\xod\_1555433968203\_sketch\xod\_1555433968203\_sketch.ino:154:5: error: declared here C:\Users\Omran\AppData\Local\Temp\xod\_temp\_sketchbookRpDenr\xod\_1555433968203\_sketch\xod\_1555433968203\_sketch.ino: At global scope: C:\Users\Omran\AppData\Local\Temp\xod\_temp\_sketchbookRpDenr\xod\_1555433968203\_sketch\xod\_1555433968203\_sketch.ino:344:27: error: expected ‘,’ or ‘…’ before ‘&&’ token C:\Users\Omran\AppData\Local\Temp\xod\_temp\_sketchbookRpDenr\xod\_1555433968203\_sketch\xod\_1555433968203\_sketch.ino: In constructor ‘xod::ConcatListView::Cursor::Cursor(xod::Iterator)’: C:\Users\Omran\AppData\Local\Temp\xod\_temp\_sketchbookRpDenr\xod\_1555433968203\_sketch\xod\_1555433968203\_sketch.ino:345:21: error: ‘move’ is not a member of ‘xod::std’ C:\Users\Omran\AppData\Local\Temp\xod\_temp\_sketchbookRpDenr\xod\_1555433968203\_sketch\xod\_1555433968203\_sketch.ino:345:31: error: ‘left’ was not declared in this scope C:\Users\Omran\AppData\Local\Temp\xod\_temp\_sketchbookRpDenr\xod\_1555433968203\_sketch\xod\_1555433968203\_sketch.ino:346:22: error: ‘move’ is not a member of ‘xod::std’ C:\Users\Omran\AppData\Local\Temp\xod\_temp\_sketchbookRpDenr\xod\_1555433968203\_sketch\xod\_1555433968203\_sketch.ino:346:32: error: ‘right’ was not declared in this scope C:\Users\Omran\AppData\Local\Temp\xod\_temp\_sketchbookRpDenr\xod\_1555433968203\_sketch\xod\_1555433968203\_sketch.ino: At global scope: C:\Users\Omran\AppData\Local\Temp\xod\_temp\_sketchbookRpDenr\xod\_1555433968203\_sketch\xod\_1555433968203\_sketch.ino:394:7: error: expected nested-name-specifier before ‘XString’ C:\Users\Omran\AppData\Local\Temp\xod\_temp\_sketchbookRpDenr\xod\_1555433968203\_sketch\xod\_1555433968203\_sketch.ino:394:7: error: ‘XString’ has not been declared C:\Users\Omran\AppData\Local\Temp\xod\_temp\_sketchbookRpDenr\xod\_1555433968203\_sketch\xod\_1555433968203\_sketch.ino:394:15: error: expected ‘;’ before ‘=’ token C:\Users\Omran\AppData\Local\Temp\xod\_temp\_sketchbookRpDenr\xod\_1555433968203\_sketch\xod\_1555433968203\_sketch.ino:394:15: error: expected unqualified-id before ‘=’ token C:\Users\Omran\AppData\Local\Temp\xod\_temp\_sketchbookRpDenr\xod\_1555433968203\_sketch\xod\_1555433968203\_sketch.ino:400:39: error: expected class-name before ‘{’ token C:\Users\Omran\AppData\Local\Temp\xod\_temp\_sketchbookRpDenr\xod\_1555433968203\_sketch\xod\_1555433968203\_sketch.ino: In constructor ‘xod::XStringCString::XStringCString(const char\*)’: C:\Users\Omran\AppData\Local\Temp\xod\_temp\_sketchbookRpDenr\xod\_1555433968203\_sketch\xod\_1555433968203\_sketch.ino:403:11: error: class ‘xod::XStringCString’ does not have any field named ‘XString’ C:\Users\Omran\AppData\Local\Temp\xod\_temp\_sketchbookRpDenr\xod\_1555433968203\_sketch\xod\_1555433968203\_sketch.ino: In member function ‘virtual SoftwareSerial\* xod::Uart::toSoftwareSerial()’: C:\Users\Omran\AppData\Local\Temp\xod\_temp\_sketchbookRpDenr\xod\_1555433968203\_sketch\xod\_1555433968203\_sketch.ino:467:14: error: ‘nullptr’ was not declared in this scope C:\Users\Omran\AppData\Local\Temp\xod\_temp\_sketchbookRpDenr\xod\_1555433968203\_sketch\xod\_1555433968203\_sketch.ino: In member function ‘virtual HardwareSerial\* xod::Uart::toHardwareSerial()’: C:\Users\Omran\AppData\Local\Temp\xod\_temp\_sketchbookRpDenr\xod\_1555433968203\_sketch\xod\_1555433968203\_sketch.ino:471:14: error: ‘nullptr’ was not declared in this scope C:\Users\Omran\AppData\Local\Temp\xod\_temp\_sketchbookRpDenr\xod\_1555433968203\_sketch\xod\_1555433968203\_sketch.ino: In function ‘TR xod::foldl(xod::List, TR (\*)(TR, T), TR)’: C:\Users\Omran\AppData\Local\Temp\xod\_temp\_sketchbookRpDenr\xod\_1555433968203\_sketch\xod\_1555433968203\_sketch.ino:560:15: error: ‘it’ does not name a type C:\Users\Omran\AppData\Local\Temp\xod\_temp\_sketchbookRpDenr\xod\_1555433968203\_sketch\xod\_1555433968203\_sketch.ino:560:34: error: expected ‘;’ before ‘it’ C:\Users\Omran\AppData\Local\Temp\xod\_temp\_sketchbookRpDenr\xod\_1555433968203\_sketch\xod\_1555433968203\_sketch.ino:560:34: error: ‘it’ was not declared in this scope C:\Users\Omran\AppData\Local\Temp\xod\_temp\_sketchbookRpDenr\xod\_1555433968203\_sketch\xod\_1555433968203\_sketch.ino: In function ‘bool xod::equal(xod::List, xod::List)’: C:\Users\Omran\AppData\Local\Temp\xod\_temp\_sketchbookRpDenr\xod\_1555433968203\_sketch\xod\_1555433968203\_sketch.ino:595:10: error: ‘lhsIt’ does not name a type C:\Users\Omran\AppData\Local\Temp\xod\_temp\_sketchbookRpDenr\xod\_1555433968203\_sketch\xod\_1555433968203\_sketch.ino:596:10: error: ‘rhsIt’ does not name a type C:\Users\Omran\AppData\Local\Temp\xod\_temp\_sketchbookRpDenr\xod\_1555433968203\_sketch\xod\_1555433968203\_sketch.ino:598:12: error: ‘lhsIt’ was not declared in this scope C:\Users\Omran\AppData\Local\Temp\xod\_temp\_sketchbookRpDenr\xod\_1555433968203\_sketch\xod\_1555433968203\_sketch.ino:598:21: error: ‘rhsIt’ was not declared in this scope C:\Users\Omran\AppData\Local\Temp\xod\_temp\_sketchbookRpDenr\xod\_1555433968203\_sketch\xod\_1555433968203\_sketch.ino:602:13: error: ‘lhsIt’ was not declared in this scope C:\Users\Omran\AppData\Local\Temp\xod\_temp\_sketchbookRpDenr\xod\_1555433968203\_sketch\xod\_1555433968203\_sketch.ino:602:23: error: ‘rhsIt’ was not declared in this scope C:\Users\Omran\AppData\Local\Temp\xod\_temp\_sketchbookRpDenr\xod\_1555433968203\_sketch\xod\_1555433968203\_sketch.ino: At global scope: C:\Users\Omran\AppData\Local\Temp\xod\_temp\_sketchbookRpDenr\xod\_1555433968203\_sketch\xod\_1555433968203\_sketch.ino:971:50: error: expected nested-name-specifier before ‘T’ C:\Users\Omran\AppData\Local\Temp\xod\_temp\_sketchbookRpDenr\xod\_1555433968203\_sketch\xod\_1555433968203\_sketch.ino:971:50: error: using-declaration for non-member at class scope C:\Users\Omran\AppData\Local\Temp\xod\_temp\_sketchbookRpDenr\xod\_1555433968203\_sketch\xod\_1555433968203\_sketch.ino:971:52: error: expected ‘;’ before ‘=’ token C:\Users\Omran\AppData\Local\Temp\xod\_temp\_sketchbookRpDenr\xod\_1555433968203\_sketch\xod\_1555433968203\_sketch.ino:971:52: error: expected unqualified-id before ‘=’ token C:\Users\Omran\AppData\Local\Temp\xod\_temp\_sketchbookRpDenr\xod\_1555433968203\_sketch\xod\_1555433968203\_sketch.ino:972:50: error: expected nested-name-specifier before ‘T’ C:\Users\Omran\AppData\Local\Temp\xod\_temp\_sketchbookRpDenr\xod\_1555433968203\_sketch\xod\_1555433968203\_sketch.ino:972:50: error: using-declaration for non-member at class scope C:\Users\Omran\AppData\Local\Temp\xod\_temp\_sketchbookRpDenr\xod\_1555433968203\_sketch\xod\_1555433968203\_sketch.ino:972:52: error: expected ‘;’ before ‘=’ token C:\Users\Omran\AppData\Local\Temp\xod\_temp\_sketchbookRpDenr\xod\_1555433968203\_sketch\xod\_1555433968203\_sketch.ino:972:52: error: expected unqualified-id before ‘=’ token C:\Users\Omran\AppData\Local\Temp\xod\_temp\_sketchbookRpDenr\xod\_1555433968203\_sketch\xod\_1555433968203\_sketch.ino:979:7: error: expected nested-name-specifier before ‘Context’ C:\Users\Omran\AppData\Local\Temp\xod\_temp\_sketchbookRpDenr\xod\_1555433968203\_sketch\xod\_1555433968203\_sketch.ino:979:7: error: ‘Context’ has not been declared C:\Users\Omran\AppData\Local\Temp\xod\_temp\_sketchbookRpDenr\xod\_1555433968203\_sketch\xod\_1555433968203\_sketch.ino:979:15: error: expected ‘;’ before ‘=’ token C:\Users\Omran\AppData\Local\Temp\xod\_temp\_sketchbookRpDenr\xod\_1555433968203\_sketch\xod\_1555433968203\_sketch.ino:979:15: error: expected unqualified-id before ‘=’ token C:\Users\Omran\AppData\Local\Temp\xod\_temp\_sketchbookRpDenr\xod\_1555433968203\_sketch\xod\_1555433968203\_sketch.ino:981:62: error: template declaration of ‘typename xod::xod\_\_core\_\_continuously::ValueType::T xod::xod\_\_core\_\_continuously::getValue’ C:\Users\Omran\AppData\Local\Temp\xod\_temp\_sketchbookRpDenr\xod\_1555433968203\_sketch\xod\_1555433968203\_sketch.ino:981:62: error: ‘Context’ was not declared in this scope C:\Users\Omran\AppData\Local\Temp\xod\_temp\_sketchbookRpDenr\xod\_1555433968203\_sketch\xod\_1555433968203\_sketch.ino:988:26: error: expected initializer before ‘\<’ token C:\Users\Omran\AppData\Local\Temp\xod\_temp\_sketchbookRpDenr\xod\_1555433968203\_sketch\xod\_1555433968203\_sketch.ino:992:45: error: template declaration of ‘bool xod::xod\_\_core\_\_continuously::isInputDirty’ C:\Users\Omran\AppData\Local\Temp\xod\_temp\_sketchbookRpDenr\xod\_1555433968203\_sketch\xod\_1555433968203\_sketch.ino:992:45: error: ‘Context’ was not declared in this scope C:\Users\Omran\AppData\Local\Temp\xod\_temp\_sketchbookRpDenr\xod\_1555433968203\_sketch\xod\_1555433968203\_sketch.ino:999:43: error: variable or field ‘emitValue’ declared void C:\Users\Omran\AppData\Local\Temp\xod\_temp\_sketchbookRpDenr\xod\_1555433968203\_sketch\xod\_1555433968203\_sketch.ino:999:43: error: ‘Context’ was not declared in this scope C:\Users\Omran\AppData\Local\Temp\xod\_temp\_sketchbookRpDenr\xod\_1555433968203\_sketch\xod\_1555433968203\_sketch.ino:999:87: error: expected ‘(’ before ‘val’ C:\Users\Omran\AppData\Local\Temp\xod\_temp\_sketchbookRpDenr\xod\_1555433968203\_sketch\xod\_1555433968203\_sketch.ino:1005:26: error: expected initializer before ‘\<’ token C:\Users\Omran\AppData\Local\Temp\xod\_temp\_sketchbookRpDenr\xod\_1555433968203\_sketch\xod\_1555433968203\_sketch.ino:1010:17: error: ‘Context’ was not declared in this scope C:\Users\Omran\AppData\Local\Temp\xod\_temp\_sketchbookRpDenr\xod\_1555433968203\_sketch\xod\_1555433968203\_sketch.ino:1010:30: error: expected ‘,’ or ‘;’ before ‘{’ token C:\Users\Omran\AppData\Local\Temp\xod\_temp\_sketchbookRpDenr\xod\_1555433968203\_sketch\xod\_1555433968203\_sketch.ino:1014:15: error: variable or field ‘evaluate’ declared void C:\Users\Omran\AppData\Local\Temp\xod\_temp\_sketchbookRpDenr\xod\_1555433968203\_sketch\xod\_1555433968203\_sketch.ino:1014:15: error: ‘Context’ was not declared in this scope C:\Users\Omran\AppData\Local\Temp\xod\_temp\_sketchbookRpDenr\xod\_1555433968203\_sketch\xod\_1555433968203\_sketch.ino:1056:50: error: expected nested-name-specifier before ‘T’ C:\Users\Omran\AppData\Local\Temp\xod\_temp\_sketchbookRpDenr\xod\_1555433968203\_sketch\xod\_1555433968203\_sketch.ino:1056:50: error: using-declaration for non-member at class scope C:\Users\Omran\AppData\Local\Temp\xod\_temp\_sketchbookRpDenr\xod\_1555433968203\_sketch\xod\_1555433968203\_sketch.ino:1056:52: error: expected ‘;’ before ‘=’ token C:\Users\Omran\AppData\Local\Temp\xod\_temp\_sketchbookRpDenr\xod\_1555433968203\_sketch\xod\_1555433968203\_sketch.ino:1056:52: error: expected unqualified-id before ‘=’ token C:\Users\Omran\AppData\Local\Temp\xod\_temp\_sketchbookRpDenr\xod\_1555433968203\_sketch\xod\_1555433968203\_sketch.ino:1057:46: error: expected nested-name-specifier before ‘T’ C:\Users\Omran\AppData\Local\Temp\xod\_temp\_sketchbookRpDenr\xod\_1555433968203\_sketch\xod\_1555433968203\_sketch.ino:1057:46: error: using-declaration for non-member at class scope C:\Users\Omran\AppData\Local\Temp\xod\_temp\_sketchbookRpDenr\xod\_1555433968203\_sketch\xod\_1555433968203\_sketch.ino:1057:48: error: expected ‘;’ before ‘=’ token C:\Users\Omran\AppData\Local\Temp\xod\_temp\_sketchbookRpDenr\xod\_1555433968203\_sketch\xod\_1555433968203\_sketch.ino:1057:48: error: expected unqualified-id before ‘=’ token C:\Users\Omran\AppData\Local\Temp\xod\_temp\_sketchbookRpDenr\xod\_1555433968203\_sketch\xod\_1555433968203\_sketch.ino:1058:49: error: expected nested-name-specifier before ‘T’ C:\Users\Omran\AppData\Local\Temp\xod\_temp\_sketchbookRpDenr\xod\_1555433968203\_sketch\xod\_1555433968203\_sketch.ino:1058:49: error: using-declaration for non-member at class scope C:\Users\Omran\AppData\Local\Temp\xod\_temp\_sketchbookRpDenr\xod\_1555433968203\_sketch\xod\_1555433968203\_sketch.ino:1058:51: error: expected ‘;’ before ‘=’ token C:\Users\Omran\AppData\Local\Temp\xod\_temp\_sketchbookRpDenr\xod\_1555433968203\_sketch\xod\_1555433968203\_sketch.ino:1058:51: error: expected unqualified-id before ‘=’ token C:\Users\Omran\AppData\Local\Temp\xod\_temp\_sketchbookRpDenr\xod\_1555433968203\_sketch\xod\_1555433968203\_sketch.ino:1059:47: error: expected nested-name-specifier before ‘T’ C:\Users\Omran\AppData\Local\Temp\xod\_temp\_sketchbookRpDenr\xod\_1555433968203\_sketch\xod\_1555433968203\_sketch.ino:1059:47: error: using-declaration for non-member at class scope C:\Users\Omran\AppData\Local\Temp\xod\_temp\_sketchbookRpDenr\xod\_1555433968203\_sketch\xod\_1555433968203\_sketch.ino:1059:49: error: expected ‘;’ before ‘=’ token C:\Users\Omran\AppData\Local\Temp\xod\_temp\_sketchbookRpDenr\xod\_1555433968203\_sketch\xod\_1555433968203\_sketch.ino:1059:49: error: expected unqualified-id before ‘=’ token C:\Users\Omran\AppData\Local\Temp\xod\_temp\_sketchbookRpDenr\xod\_1555433968203\_sketch\xod\_1555433968203\_sketch.ino:1060:48: error: expected nested-name-specifier before ‘T’ C:\Users\Omran\AppData\Local\Temp\xod\_temp\_sketchbookRpDenr\xod\_1555433968203\_sketch\xod\_1555433968203\_sketch.ino:1060:48: error: using-declaration for non-member at class scope C:\Users\Omran\AppData\Local\Temp\xod\_temp\_sketchbookRpDenr\xod\_1555433968203\_sketch\xod\_1555433968203\_sketch.ino:1060:50: error: expected ‘;’ before ‘=’ token C:\Users\Omran\AppData\Local\Temp\xod\_temp\_sketchbookRpDenr\xod\_1555433968203\_sketch\xod\_1555433968203\_sketch.ino:1060:50: error: expected unqualified-id before ‘=’ token C:\Users\Omran\AppData\Local\Temp\xod\_temp\_sketchbookRpDenr\xod\_1555433968203\_sketch\xod\_1555433968203\_sketch.ino:1061:49: error: expected nested-name-specifier before ‘T’ C:\Users\Omran\AppData\Local\Temp\xod\_temp\_sketchbookRpDenr\xod\_1555433968203\_sketch\xod\_1555433968203\_sketch.ino:1061:49: error: using-declaration for non-member at class scope C:\Users\Omran\AppData\Local\Temp\xod\_temp\_sketchbookRpDenr\xod\_1555433968203\_sketch\xod\_1555433968203\_sketch.ino:1061:51: error: expected ‘;’ before ‘=’ token C:\Users\Omran\AppData\Local\Temp\xod\_temp\_sketchbookRpDenr\xod\_1555433968203\_sketch\xod\_1555433968203\_sketch.ino:1061:51: error: expected unqualified-id before ‘=’ token C:\Users\Omran\AppData\Local\Temp\xod\_temp\_sketchbookRpDenr\xod\_1555433968203\_sketch\xod\_1555433968203\_sketch.ino:1062:47: error: expected nested-name-specifier before ‘T’ C:\Users\Omran\AppData\Local\Temp\xod\_temp\_sketchbookRpDenr\xod\_1555433968203\_sketch\xod\_1555433968203\_sketch.ino:1062:47: error: using-declaration for non-member at class scope C:\Users\Omran\AppData\Local\Temp\xod\_temp\_sketchbookRpDenr\xod\_1555433968203\_sketch\xod\_1555433968203\_sketch.ino:1062:49: error: expected ‘;’ before ‘=’ token C:\Users\Omran\AppData\Local\Temp\xod\_temp\_sketchbookRpDenr\xod\_1555433968203\_sketch\xod\_1555433968203\_sketch.ino:1062:49: error: expected unqualified-id before ‘=’ token C:\Users\Omran\AppData\Local\Temp\xod\_temp\_sketchbookRpDenr\xod\_1555433968203\_sketch\xod\_1555433968203\_sketch.ino:1075:7: error: expected nested-name-specifier before ‘Context’ C:\Users\Omran\AppData\Local\Temp\xod\_temp\_sketchbookRpDenr\xod\_1555433968203\_sketch\xod\_1555433968203\_sketch.ino:1075:7: error: ‘Context’ has not been declared C:\Users\Omran\AppData\Local\Temp\xod\_temp\_sketchbookRpDenr\xod\_1555433968203\_sketch\xod\_1555433968203\_sketch.ino:1075:15: error: expected ‘;’ before ‘=’ token C:\Users\Omran\AppData\Local\Temp\xod\_temp\_sketchbookRpDenr\xod\_1555433968203\_sketch\xod\_1555433968203\_sketch.ino:1075:15: error: expected unqualified-id before ‘=’ token C:\Users\Omran\AppData\Local\Temp\xod\_temp\_sketchbookRpDenr\xod\_1555433968203\_sketch\xod\_1555433968203\_sketch.ino:1077:62: error: template declaration of ‘typename xod::xod\_\_core\_\_square\_wave::ValueType::T xod::xod\_\_core\_\_square\_wave::getValue’ C:\Users\Omran\AppData\Local\Temp\xod\_temp\_sketchbookRpDenr\xod\_1555433968203\_sketch\xod\_1555433968203\_sketch.ino:1077:62: error: ‘Context’ was not declared in this scope C:\Users\Omran\AppData\Local\Temp\xod\_temp\_sketchbookRpDenr\xod\_1555433968203\_sketch\xod\_1555433968203\_sketch.ino:1084:27: error: expected initializer before ‘\<’ token C:\Users\Omran\AppData\Local\Temp\xod\_temp\_sketchbookRpDenr\xod\_1555433968203\_sketch\xod\_1555433968203\_sketch.ino:1087:27: error: expected initializer before ‘\<’ token C:\Users\Omran\AppData\Local\Temp\xod\_temp\_sketchbookRpDenr\xod\_1555433968203\_sketch\xod\_1555433968203\_sketch.ino:1090:26: error: expected initializer before ‘\<’ token C:\Users\Omran\AppData\Local\Temp\xod\_temp\_sketchbookRpDenr\xod\_1555433968203\_sketch\xod\_1555433968203\_sketch.ino:1093:26: error: expected initializer before ‘\<’ token C:\Users\Omran\AppData\Local\Temp\xod\_temp\_sketchbookRpDenr\xod\_1555433968203\_sketch\xod\_1555433968203\_sketch.ino:1096:26: error: expected initializer before ‘\<’ token C:\Users\Omran\AppData\Local\Temp\xod\_temp\_sketchbookRpDenr\xod\_1555433968203\_sketch\xod\_1555433968203\_sketch.ino:1099:27: error: expected initializer before ‘\<’ token C:\Users\Omran\AppData\Local\Temp\xod\_temp\_sketchbookRpDenr\xod\_1555433968203\_sketch\xod\_1555433968203\_sketch.ino:1103:45: error: template declaration of ‘bool xod::xod\_\_core\_\_square\_wave::isInputDirty’ C:\Users\Omran\AppData\Local\Temp\xod\_temp\_sketchbookRpDenr\xod\_1555433968203\_sketch\xod\_1555433968203\_sketch.ino:1103:45: error: ‘Context’ was not declared in this scope C:\Users\Omran\AppData\Local\Temp\xod\_temp\_sketchbookRpDenr\xod\_1555433968203\_sketch\xod\_1555433968203\_sketch.ino:1110:29: error: expected initializer before ‘\<’ token C:\Users\Omran\AppData\Local\Temp\xod\_temp\_sketchbookRpDenr\xod\_1555433968203\_sketch\xod\_1555433968203\_sketch.ino:1114:43: error: variable or field ‘emitValue’ declared void C:\Users\Omran\AppData\Local\Temp\xod\_temp\_sketchbookRpDenr\xod\_1555433968203\_sketch\xod\_1555433968203\_sketch.ino:1114:43: error: ‘Context’ was not declared in this scope C:\Users\Omran\AppData\Local\Temp\xod\_temp\_sketchbookRpDenr\xod\_1555433968203\_sketch\xod\_1555433968203\_sketch.ino:1114:87: error: expected ‘(’ before ‘val’ C:\Users\Omran\AppData\Local\Temp\xod\_temp\_sketchbookRpDenr\xod\_1555433968203\_sketch\xod\_1555433968203\_sketch.ino:1120:26: error: expected initializer before ‘\<’ token C:\Users\Omran\AppData\Local\Temp\xod\_temp\_sketchbookRpDenr\xod\_1555433968203\_sketch\xod\_1555433968203\_sketch.ino:1124:26: error: expected initializer before ‘\<’ token C:\Users\Omran\AppData\Local\Temp\xod\_temp\_sketchbookRpDenr\xod\_1555433968203\_sketch\xod\_1555433968203\_sketch.ino:1129:17: error: ‘Context’ was not declared in this scope C:\Users\Omran\AppData\Local\Temp\xod\_temp\_sketchbookRpDenr\xod\_1555433968203\_sketch\xod\_1555433968203\_sketch.ino:1129:30: error: expected ‘,’ or ‘;’ before ‘{’ token C:\Users\Omran\AppData\Local\Temp\xod\_temp\_sketchbookRpDenr\xod\_1555433968203\_sketch\xod\_1555433968203\_sketch.ino:1133:15: error: variable or field ‘evaluate’ declared void C:\Users\Omran\AppData\Local\Temp\xod\_temp\_sketchbookRpDenr\xod\_1555433968203\_sketch\xod\_1555433968203\_sketch.ino:1133:15: error: ‘Context’ was not declared in this scope C:\Users\Omran\AppData\Local\Temp\xod\_temp\_sketchbookRpDenr\xod\_1555433968203\_sketch\xod\_1555433968203\_sketch.ino:1486:28: error: expected ‘}’ before end of line C:\Users\Omran\AppData\Local\Temp\xod\_temp\_sketchbookRpDenr\xod\_1555433968203\_sketch\xod\_1555433968203\_sketch.ino:1486:28: error: expected ‘}’ before end of line C:\Users\Omran\AppData\Local\Temp\xod\_temp\_sketchbookRpDenr\xod\_1555433968203\_sketch\xod\_1555433968203\_sketch.ino:1486:28: error: expected declaration before end of line C:\Users\Omran\AppData\Local\Temp\xod\_temp\_sketchbookRpDenr\xod\_1555433968203\_sketch\xod\_1555433968203\_sketch.ino: In instantiation of ‘static xod::Iterator xod::Iterator::nil() [with T = char]’: C:\Users\Omran\AppData\Local\Temp\xod\_temp\_sketchbookRpDenr\xod\_1555433968203\_sketch\xod\_1555433968203\_sketch.ino:326:74: required from here C:\Users\Omran\AppData\Local\Temp\xod\_temp\_sketchbookRpDenr\xod\_1555433968203\_sketch\xod\_1555433968203\_sketch.ino:142:54: error: use of deleted function ‘xod::Iterator::Iterator(const xod::Iterator&) [with T = char; xod::Iterator = xod::Iterator]’ C:\Users\Omran\AppData\Local\Temp\xod\_temp\_sketchbookRpDenr\xod\_1555433968203\_sketch\xod\_1555433968203\_sketch.ino:154:5: error: declared here Error: exit status 1 Compilation failed.

Compilation failed Command `C:\Program Files\XOD IDE\resources\arduino-cli.exe --config-file=C:\Users\Omran\AppData\Local\Temp\arduino-clieZBpQw\.cli-config.yml compile --fqbn Intel:i586:izmir_fg --verbose C:\Users\Omran\AppData\Local\Temp\xod_temp_sketchbookRpDenr\xod_1555433968203_sketch` failed with code 1 The generated C++ code contains errors. It can be due to a bad node implementation or if your board is not compatible with XOD runtime code. The original compiler error message is above. Fix C++ errors to continue. If you believe it is a bug, report the problem to XOD developers.

“

---

<div class="post-metadata">

**Author:** ![cesars](https://avatars.discourse-cdn.com/v4/letter/c/f05b48/32.png) [@cesars](https://forum.xod.io/u/cesars)\
**Post date:** [April 16, 2019, 5:15pm UTC](https://forum.xod.io/t/problem-deploying-to-intel-galileo-board/2134/11 "2019-04-16T17:15:29Z")

</div>

> [@omran](#):
>
> C:\Users\Omran\AppData\Local\Temp\xod\_temp\_sketchbookRpDenr\xod\_1555433968203\_sketch\xod\_1555433968203\_sketch.ino:60:48: error: template argument 1 is invalid

The error message is in this line in \<T&`&`\>

```auto
//60:48
template< class T > struct remove_reference<T&&> {typedef T type;};  

```

```auto
//63:35
typename remove_reference<T>::type&& move(T&& a) {  

```

Maybe it’s all compatibility problem …

---

<div class="post-metadata">

**Author:** ![omran](https://yyz1.discourse-cdn.com/flex027/user_avatar/forum.xod.io/omran/32/1112_2.png) [@omran](https://forum.xod.io/u/omran)\
**Post date:** [April 16, 2019, 5:31pm UTC](https://forum.xod.io/t/problem-deploying-to-intel-galileo-board/2134/12 "2019-04-16T17:31:56Z")

</div>

How I can report this problem to XOD developers team?

---

<div class="post-metadata">

**Author:** ![cesars](https://avatars.discourse-cdn.com/v4/letter/c/f05b48/32.png) [@cesars](https://forum.xod.io/u/cesars)\
**Post date:** [April 16, 2019, 5:36pm UTC](https://forum.xod.io/t/problem-deploying-to-intel-galileo-board/2134/13 "2019-04-16T17:36:19Z")

</div>

I think he has already done this topic, @brusher_ru is part of the team, just wait for a response 🙂

---

<div class="post-metadata">

**Author:** ![brusher\_ru](https://yyz1.discourse-cdn.com/flex027/user_avatar/forum.xod.io/brusher_ru/32/12_2.png) [@brusher\_ru](https://forum.xod.io/u/brusher_ru)\
**Post date:** [April 17, 2019, 9:42am UTC](https://forum.xod.io/t/problem-deploying-to-intel-galileo-board/2134/14 "2019-04-17T09:42:52Z")

</div>

@vitaliysh you have to add an URL for extra package ( [https://raw.githubusercontent.com/amperka/iskra-boards/master/package\_amperka\_index.json](https://raw.githubusercontent.com/amperka/iskra-boards/master/package_amperka_index.json) ) into `your_workspace/ __packages__ /extra.txt` at the new line.  
Then you’ll see an “Amperka Iskra Nano Pro” in the list of boards. Select it, download and install toolchains if needed and upload 🙂

---

<div class="post-metadata">

**Author:** ![vitaliysh](https://yyz1.discourse-cdn.com/flex027/user_avatar/forum.xod.io/vitaliysh/32/1428_2.png) [@vitaliysh](https://forum.xod.io/u/vitaliysh)\
**Post date:** [April 17, 2019, 10:35am UTC](https://forum.xod.io/t/problem-deploying-to-intel-galileo-board/2134/15 "2019-04-17T10:35:57Z")

</div>

Thank. Everything worked fine with Iskra Nano Pro.

---

<div class="post-metadata">

**Author:** ![unel](https://yyz1.discourse-cdn.com/flex027/user_avatar/forum.xod.io/unel/32/1782_2.png) [@unel](https://forum.xod.io/u/unel)\
**Post date:** [December 28, 2019, 3:53pm UTC](https://forum.xod.io/t/problem-deploying-to-intel-galileo-board/2134/16 "2019-12-28T15:53:40Z")

</div>

I apologize for breaking into the old topic, but the “Iskra Nano Pro” doesn’t work for me, an error occurs when trying to deploy:

```auto
Begin compiling code for the board Amperka Iskra Nano Pro 📦

Using board 'iskra-nano-pro' from platform in folder: /Users/unel/xod/ __packages__ /packages/amperka-iskra/hardware/avr/0.1.2

panic: runtime error: invalid memory address or nil pointer dereference
[signal SIGSEGV: segmentation violation code=0x1 addr=0x68 pc=0x457f5b6]

goroutine 1 [running]:

github.com/arduino/arduino-cli/vendor/github.com/arduino/arduino-builder.(*TargetBoardResolver).Run(0x4b0b340, 0xc420294e00, 0x4b0b340, 0x0)
	/home/jenkins/workspace/arduino-cli-pr-builder/src/github.com/arduino/arduino-cli/vendor/github.com/arduino/arduino-builder/target_board_resolver.go:61 +0x4b6
github.com/arduino/arduino-cli/vendor/github.com/arduino/arduino-builder.(*ContainerSetupHardwareToolsLibsSketchAndProps).Run(0x4b0b340, 0xc420294e00, 0x4b0b340, 0x0)
	/home/jenkins/workspace/arduino-cli-pr-builder/src/github.com/arduino/arduino-cli/vendor/github.com/arduino/arduino-builder/container_setup.go:63 +0x41d
github.com/arduino/arduino-cli/vendor/github.com/arduino/arduino-builder.runCommands(0xc420294e00, 0xc4201f7740, 0x22, 0x22, 0x1, 0x0, 0x0)
	/home/jenkins/workspace/arduino-cli-pr-builder/src/github.com/arduino/arduino-cli/vendor/github.com/arduino/arduino-builder/builder.go:191 +0xe5

github.com/arduino/arduino-cli/vendor/github.com/arduino/arduino-builder.(*Builder).Run(0xc4201f7990, 0xc420294e00, 0x47981c0, 0xc42031b590)
	/home/jenkins/workspace/arduino-cli-pr-builder/src/github.com/arduino/arduino-cli/vendor/github.com/arduino/arduino-builder/builder.go:109 +0xcf7
github.com/arduino/arduino-cli/vendor/github.com/arduino/arduino-builder.RunBuilder(0xc420294e00, 0x0, 0x47981c0)
	/home/jenkins/workspace/arduino-cli-pr-builder/src/github.com/arduino/arduino-cli/vendor/github.com/arduino/arduino-builder/builder.go:207 +0x35
github.com/arduino/arduino-cli/commands/compile.run(0xc42020d180, 0xc42009cd40, 0x1, 0x4)
	/home/jenkins/workspace/arduino-cli-pr-builder/src/github.com/arduino/arduino-cli/commands/compile/compile.go:240 +0x1446
github.com/arduino/arduino-cli/vendor/github.com/spf13/cobra.(*Command).execute(0xc42020d180, 0xc42009cd00, 0x4, 0x4, 0xc42020d180, 0xc42009cd00)
	/home/jenkins/workspace/arduino-cli-pr-builder/src/github.com/arduino/arduino-cli/vendor/github.com/spf13/cobra/command.go:760 +0x2c1
github.com/arduino/arduino-cli/vendor/github.com/spf13/cobra.(*Command).ExecuteC(0xc42020c280, 0xc420233180, 0xc42020db80, 0xc42020d400)
	/home/jenkins/workspace/arduino-cli-pr-builder/src/github.com/arduino/arduino-cli/vendor/github.com/spf13/cobra/command.go:846 +0x30a
github.com/arduino/arduino-cli/vendor/github.com/spf13/cobra.(*Command).Execute(0xc42020c280, 
0x45aac97, 0xc4201f7f78)
	/home/jenkins/workspace/arduino-cli-pr-builder/src/github.com/arduino/arduino-cli/vendor/github.com/spf13/cobra/command.go:794 +0x2b
main.main()
	/home/jenkins/workspace/arduino-cli-pr-builder/src/github.com/arduino/arduino-cli/main.go:30 +0x27
Compilation failed
Command Process exited with code 2
The generated C++ code contains errors. It can be due to a bad node implementation or if your board is not compatible with XOD runtime code. The original compiler error message is above. Fix C++ errors to continue. If you believe it is a bug, report the problem to XOD developers.

```
